{"text_format":"1","workbook":"xlsx","n_sheets":8,"sheets":["Código CIIU","Departamentos_y_municipios_de_C","Hoja2","MatrizSegmentación","PorJurisdicción","PorActividadEconómica","MatrizMonitoreo","S.AlertaCuantitativas"],"not_rendered":{"charts":2,"images":0,"macros":1,"external_links":1,"defined_names":41,"comments":0,"pivot_tables":13},"unopened":[],"bounds":{"document_bytes":16777216,"sheet_cells":100000,"rows_first":2000,"rows_last":500,"rows_between":2000,"halvings":0,"cell_chars":16384,"cell_head_chars":4096},"cells_cut":0,"cells_raw":0,"read":"whole","date_system":"1900"}

{"sheet":"Código CIIU","index":0,"n_rows":499,"n_cols":8,"rows_kept":499,"cut":false,"hidden":true,"merged":[]}
[null,null,null,null,"Si","Fortaleza",0,"Agropecuario"]
[111,"Cultivo de cereales (excepto arroz), legumbres y semillas oleaginosas",1,"agricultura, ganadería, caza, silvicultura y pesca","No","Debilidad",1,"Industrial"]
[112,"Cultivo de arroz",1,"agricultura, ganadería, caza, silvicultura y pesca",null,null,2,"Comercio"]
[113,"Cultivo de hortalizas, raíces y tubérculos",1,"agricultura, ganadería, caza, silvicultura y pesca",null,null,3,"Servicios"]
[114,"Cultivo de tabaco",1,"agricultura, ganadería, caza, silvicultura y pesca"]
[115,"Cultivo de plantas textiles",1,"agricultura, ganadería, caza, silvicultura y pesca"]
[119,"Otros cultivos transitorios n.c.p.",1,"agricultura, ganadería, caza, silvicultura y pesca"]
[121,"Cultivo de frutas tropicales y subtropicales",1,"agricultura, ganadería, caza, silvicultura y pesca"]
[122,"Cultivo de plátano y banano",1,"agricultura, ganadería, caza, silvicultura y pesca"]
[123,"Cultivo de café",1,"agricultura, ganadería, caza, silvicultura y pesca"]
[124,"Cultivo de caña de azúcar",1,"agricultura, ganadería, caza, silvicultura y pesca"]
[125,"Cultivo de flor de corte",1,"agricultura, ganadería, caza, silvicultura y pesca"]
[126,"Cultivo de palma para aceite (palma africana) y otros frutos oleaginosos",1,"agricultura, ganadería, caza, silvicultura y pesca"]
[127,"Cultivo de plantas con las que se preparan bebidas",1,"agricultura, ganadería, caza, silvicultura y pesca"]
[128,"Cultivo de especias y de plantas aromáticas y medicinales",1,"agricultura, ganadería, caza, silvicultura y pesca"]
{"$rows_left_out":485}
{"sheet":"Departamentos_y_municipios_de_C","index":1,"n_rows":1124,"n_cols":3,"rows_kept":1124,"cut":false,"hidden":true,"merged":[]}
["DPTO","DEPARTAMENTO","MUNICIPIO"]
["Amazonas","Amazonas","El Encanto"]
["Antioquia","Amazonas","La Chorrera"]
["Arauca","Amazonas","La Pedrera"]
["San_Andrés","Amazonas","La Victoria"]
["Atlántico","Amazonas","Leticia"]
["Bogotá","Amazonas","Miriti Paraná"]
["Bolívar","Amazonas","Puerto Alegría"]
["Boyacá","Amazonas","Puerto Arica"]
["Caldas","Amazonas","Puerto Nariño"]
["Caquetá","Amazonas","Puerto Santander"]
["Casanare","Amazonas","Tarapacá"]
["Cauca","Antioquia","Abejorral"]
["Cesar","Antioquia","Abriaquí"]
["Chocó","Antioquia","Alejandría"]
{"$rows_left_out":1110}
{"sheet":"Hoja2","index":2,"n_rows":261,"n_cols":16,"rows_kept":261,"cut":false,"hidden":true,"merged":[]}
[0,"Si","Cliente","Cedula de ciudadania","Natural","Manufacturero",null,"Enero",1,null,2022,null,0.7,0.25,null,0]
[1,"No","Proveedor","NIT","Juridica","Servicios",null,"Febrero",2,null,2023,null,0.75,0.5,null,0.5]
[2,null,"Empleado","Pasaporte",null,"Comercio",null,"Marzo",3,null,2024,null,0.8,0.75,null,1]
[3,null,"Accionista","Cedula de Extranjeria",null,"NA",null,"Abril",4,null,2025,null,0.85,1,null,1.5]
[4,null,"Aliado de negocio","Otra",null,null,null,"Mayo",5,null,2026,null,0.9,1.25,null,2]
[5,null,"Usuario Final",null,null,null,null,"Junio",6,null,2027,null,0.95,1.5,null,2.5]
[null,null,null,null,null,null,null,"Julio",7,null,2028,null,null,1.75,null,3]
[null,null,null,null,null,null,null,"Agosto",8,null,2029,null,null,2,null,3.5]
[null,null,null,"Manufacturero","Servicios","Comercio",null,"Septiembre",9,null,2030,null,null,null,null,4]
[null,null,"Microempresa",{"$f":"23563*MatrizSegmentación!$D$2/1000","v":855525.40399999998},{"$f":"32988*MatrizSegmentación!$D$2/1000","v":1197728.304},{"$f":"44769*MatrizSegmentación!$D$2/1000","v":1625472.852},{"$f":"+IF(MatrizSegmentación!X5<=Hoja2!D10,Hoja2!C10,\"\")","v":""},"Octubre",10,null,2031,null,null,null,null,4.5]
[null,null,"Pequeña",{"$f":"204995*MatrizSegmentación!$D$2/1000","v":7442958.46},{"$f":"131951*MatrizSegmentación!$D$2/1000","v":4790876.9079999998},{"$f":"431196*MatrizSegmentación!$D$2/1000","v":15655864.368000001},null,"Noviembre",11,null,2032,null,null,null,null,5]
[null,null,"Mediana",{"$f":"1736565*MatrizSegmentación!$D$2/1000","v":63051202.020000003},{"$f":"483034*MatrizSegmentación!$D$2/1000","v":17537998.471999999},{"$f":"2160692*MatrizSegmentación!$D$2/1000","v":78450405.136000007},null,"Diciembre",12,null,2033]
[null,null,"Grande",10000000000,10000000000,10000000000,null,null,null,null,2034]
[null,null,null,null,null,null,null,null,null,null,2035]
[null,null,null,null,null,null,null,null,null,null,2036]
{"$rows_left_out":247}
{"sheet":"MatrizSegmentación","index":3,"n_rows":100,"n_cols":25,"rows_kept":100,"cut":false,"hidden":false,"merged":[[1,1,1,2]]}
[]
[null,"VALOR DEL UVT ULTIMO AÑO",null,36308]
[]
[null,"Tipo de contraparte","Tipo de Persona","Tipo de Identificación","Numero de Identificación","Nombre","Verificado en Listas Restrictivas","PEP","Pais","Pais Cooperante","Departamento","Municipio","Nivel de Riesgo Jurisdicción","Sector","Actividad economica principal (Codigo CIIU)","Actividad económica principal","Actividad económica secundaria (Codigo CIIU)","Actividad económica secundaría","Nivel de utilización insumos que pueden ser usados en actividades ilegales","Nivel de riesgo asociado a la actividad económica","Es un PEP o tiene relación con PEPs","Nivel de realizacion de actividades en efectivo por montos elevados","Nivel de Riesgo Actividad Económica","Ingresos del ultimo año(miles de pesos)","Tipo de empresa"]
[null,"Cliente","Natural","Cedula de ciudadania",79951201,"PEDRO PEREZ","Si","Si","COLOMBIA","Si","Quindío","Circasia",3.5,"NA",10,{"$f":"IFERROR(_xlfn.XLOOKUP(O5,'Código CIIU'!$A$2:$A$499,'Código CIIU'!$B$2:$B$499),\"\")","v":"Empleado"},null,{"$f":"IFERROR(_xlfn.XLOOKUP(MatrizSegmentación!Q5,'Código CIIU'!$A$2:$A$499,'Código CIIU'!$B$2:$B$499),\"\")","v":""},0,0,5,0,{"$f":"IFERROR(AVERAGE(S5:V5),\"\")","v":1.25},200000000,{"$f":"IFERROR(IF(N5=\"Manufacturero\",_xlfn.XLOOKUP(X5,Hoja2!$D$10:$D$13,Hoja2!$C$10:$C$13,,1),IF(N5=\"Servicios\",_xlfn.XLOOKUP(X5,Hoja2!$E$10:$E$13,Hoja2!$C$10:$C$13,,1),IF(N5=\"Comercio\",_xlfn.XLOOKUP(X5,Hoja2!$F$10:$F$13,Hoja2!$C$10:$C$13,,1),\"P. Natural\"))),\"\")","v":"P. Natural"}]
[null,"Proveedor","Juridica","NIT","900.111.222-2","FABRICA XYZ","Si","No","COLOMBIA","Si","Cauca","Cajibío",5,"Manufacturero",3210,{"$f":"IFERROR(_xlfn.XLOOKUP(O6,'Código CIIU'!$A$2:$A$499,'Código CIIU'!$B$2:$B$499),\"\")","v":"Fabricación de joyas, bisutería y artículos conexos"},null,{"$f":"IFERROR(_xlfn.XLOOKUP(MatrizSegmentación!Q6,'Código CIIU'!$A$2:$A$499,'Código CIIU'!$B$2:$B$499),\"\")","v":""},0,3.5,0,3.5,{"$f":"IFERROR(AVERAGE(S6:V6),\"\")","v":1.75},100000000,{"$f":"IFERROR(IF(N6=\"Manufacturero\",_xlfn.XLOOKUP(X6,Hoja2!$D$10:$D$13,Hoja2!$C$10:$C$13,,1),IF(N6=\"Servicios\",_xlfn.XLOOKUP(X6,Hoja2!$E$10:$E$13,Hoja2!$C$10:$C$13,,1),IF(N6=\"Comercio\",_xlfn.XLOOKUP(X6,Hoja2!$F$10:$F$13,Hoja2!$C$10:$C$13,,1),\"P. Natural\"))),\"\")","v":"Grande"}]
[null,"Aliado de negocio","Juridica","NIT","860.333.111-3","XLM CONSULTORES","Si","No","PANAMA","No","Otro",null,5,"Manufacturero",2819,{"$f":"IFERROR(_xlfn.XLOOKUP(O7,'Código CIIU'!$A$2:$A$499,'Código CIIU'!$B$2:$B$499),\"\")","v":"Fabricación de otros tipos de maquinaria y equipo de uso general n.c.p."},null,{"$f":"IFERROR(_xlfn.XLOOKUP(MatrizSegmentación!Q7,'Código CIIU'!$A$2:$A$499,'Código CIIU'!$B$2:$B$499),\"\")","v":""},0,1,0,0,0.25,50000000,{"$f":"IFERROR(IF(N7=\"Manufacturero\",_xlfn.XLOOKUP(X7,Hoja2!$D$10:$D$13,Hoja2!$C$10:$C$13,,1),IF(N7=\"Servicios\",_xlfn.XLOOKUP(X7,Hoja2!$E$10:$E$13,Hoja2!$C$10:$C$13,,1),IF(N7=\"Comercio\",_xlfn.XLOOKUP(X7,Hoja2!$F$10:$F$13,Hoja2!$C$10:$C$13,,1),\"P. Natural\"))),\"\")","v":"Mediana"}]
[null,"Empleado","Natural","Cedula de ciudadania",1010110112,"MIGUEL HERNANDEZ","Si","No","COLOMBIA","Si","Bogotá","Bogotá",0,"NA",10,{"$f":"IFERROR(_xlfn.XLOOKUP(O8,'Código CIIU'!$A$2:$A$499,'Código CIIU'!$B$2:$B$499),\"\")","v":"Empleado"},null,{"$f":"IFERROR(_xlfn.XLOOKUP(MatrizSegmentación!Q8,'Código CIIU'!$A$2:$A$499,'Código CIIU'!$B$2:$B$499),\"\")","v":""},0,0,0,0,0,60000000,{"$f":"IFERROR(IF(N8=\"Manufacturero\",_xlfn.XLOOKUP(X8,Hoja2!$D$10:$D$13,Hoja2!$C$10:$C$13,,1),IF(N8=\"Servicios\",_xlfn.XLOOKUP(X8,Hoja2!$E$10:$E$13,Hoja2!$C$10:$C$13,,1),IF(N8=\"Comercio\",_xlfn.XLOOKUP(X8,Hoja2!$F$10:$F$13,Hoja2!$C$10:$C$13,,1),\"P. Natural\"))),\"\")","v":"P. Natural"}]
[null,"Usuario Final","Natural","Cedula de Extranjeria",10101010,"LINA GOMEZ","Si","Si","PANAMA","No","Otro",null,5,"NA",90,{"$f":"IFERROR(_xlfn.XLOOKUP(O9,'Código CIIU'!$A$2:$A$499,'Código CIIU'!$B$2:$B$499),\"\")","v":"Rentista de capital"},null,{"$f":"IFERROR(_xlfn.XLOOKUP(MatrizSegmentación!Q9,'Código CIIU'!$A$2:$A$499,'Código CIIU'!$B$2:$B$499),\"\")","v":""},0,0,5,0,1.25,2000000000,{"$f":"IFERROR(IF(N9=\"Manufacturero\",_xlfn.XLOOKUP(X9,Hoja2!$D$10:$D$13,Hoja2!$C$10:$C$13,,1),IF(N9=\"Servicios\",_xlfn.XLOOKUP(X9,Hoja2!$E$10:$E$13,Hoja2!$C$10:$C$13,,1),IF(N9=\"Comercio\",_xlfn.XLOOKUP(X9,Hoja2!$F$10:$F$13,Hoja2!$C$10:$C$13,,1),\"P. Natural\"))),\"\")","v":"P. Natural"}]
[null,null,null,null,null,null,null,null,null,null,null,null,null,null,null,{"$f":"IFERROR(_xlfn.XLOOKUP(O10,'Código CIIU'!$A$2:$A$499,'Código CIIU'!$B$2:$B$499),\"\")","v":""},null,{"$f":"IFERROR(_xlfn.XLOOKUP(MatrizSegmentación!Q10,'Código CIIU'!$A$2:$A$499,'Código CIIU'!$B$2:$B$499),\"\")","v":""},null,null,null,null,"",null,{"$f":"IFERROR(IF(N10=\"Manufacturero\",_xlfn.XLOOKUP(X10,Hoja2!$D$10:$D$13,Hoja2!$C$10:$C$13,,1),IF(N10=\"Servicios\",_xlfn.XLOOKUP(X10,Hoja2!$E$10:$E$13,Hoja2!$C$10:$C$13,,1),IF(N10=\"Comercio\",_xlfn.XLOOKUP(X10,Hoja2!$F$10:$F$13,Hoja2!$C$10:$C$13,,1),\"P. Natural\"))),\"\")","v":"P. Natural"}]
[null,null,null,null,null,null,null,null,null,null,null,null,null,null,null,{"$f":"IFERROR(_xlfn.XLOOKUP(O11,'Código CIIU'!$A$2:$A$499,'Código CIIU'!$B$2:$B$499),\"\")","v":""},null,{"$f":"IFERROR(_xlfn.XLOOKUP(MatrizSegmentación!Q11,'Código CIIU'!$A$2:$A$499,'Código CIIU'!$B$2:$B$499),\"\")","v":""},null,null,null,null,"",null,{"$f":"IFERROR(IF(N11=\"Manufacturero\",_xlfn.XLOOKUP(X11,Hoja2!$D$10:$D$13,Hoja2!$C$10:$C$13,,1),IF(N11=\"Servicios\",_xlfn.XLOOKUP(X11,Hoja2!$E$10:$E$13,Hoja2!$C$10:$C$13,,1),IF(N11=\"Comercio\",_xlfn.XLOOKUP(X11,Hoja2!$F$10:$F$13,Hoja2!$C$10:$C$13,,1),\"P. Natural\"))),\"\")","v":"P. Natural"}]
[null,null,null,null,null,null,null,null,null,null,null,null,null,null,null,{"$f":"IFERROR(_xlfn.XLOOKUP(O12,'Código CIIU'!$A$2:$A$499,'Código CIIU'!$B$2:$B$499),\"\")","v":""},null,{"$f":"IFERROR(_xlfn.XLOOKUP(MatrizSegmentación!Q12,'Código CIIU'!$A$2:$A$499,'Código CIIU'!$B$2:$B$499),\"\")","v":""},null,null,null,null,"",null,{"$f":"IFERROR(IF(N12=\"Manufacturero\",_xlfn.XLOOKUP(X12,Hoja2!$D$10:$D$13,Hoja2!$C$10:$C$13,,1),IF(N12=\"Servicios\",_xlfn.XLOOKUP(X12,Hoja2!$E$10:$E$13,Hoja2!$C$10:$C$13,,1),IF(N12=\"Comercio\",_xlfn.XLOOKUP(X12,Hoja2!$F$10:$F$13,Hoja2!$C$10:$C$13,,1),\"P. Natural\"))),\"\")","v":"P. Natural"}]
[null,null,null,null,null,null,null,null,null,null,null,null,null,null,null,{"$f":"IFERROR(_xlfn.XLOOKUP(O13,'Código CIIU'!$A$2:$A$499,'Código CIIU'!$B$2:$B$499),\"\")","v":""},null,{"$f":"IFERROR(_xlfn.XLOOKUP(MatrizSegmentación!Q13,'Código CIIU'!$A$2:$A$499,'Código CIIU'!$B$2:$B$499),\"\")","v":""},null,null,null,null,"",null,{"$f":"IFERROR(IF(N13=\"Manufacturero\",_xlfn.XLOOKUP(X13,Hoja2!$D$10:$D$13,Hoja2!$C$10:$C$13,,1),IF(N13=\"Servicios\",_xlfn.XLOOKUP(X13,Hoja2!$E$10:$E$13,Hoja2!$C$10:$C$13,,1),IF(N13=\"Comercio\",_xlfn.XLOOKUP(X13,Hoja2!$F$10:$F$13,Hoja2!$C$10:$C$13,,1),\"P. Natural\"))),\"\")","v":"P. Natural"}]
[null,null,null,null,null,null,null,null,null,null,null,null,null,null,null,{"$f":"IFERROR(_xlfn.XLOOKUP(O14,'Código CIIU'!$A$2:$A$499,'Código CIIU'!$B$2:$B$499),\"\")","v":""},null,{"$f":"IFERROR(_xlfn.XLOOKUP(MatrizSegmentación!Q14,'Código CIIU'!$A$2:$A$499,'Código CIIU'!$B$2:$B$499),\"\")","v":""},null,null,null,null,"",null,{"$f":"IFERROR(IF(N14=\"Manufacturero\",_xlfn.XLOOKUP(X14,Hoja2!$D$10:$D$13,Hoja2!$C$10:$C$13,,1),IF(N14=\"Servicios\",_xlfn.XLOOKUP(X14,Hoja2!$E$10:$E$13,Hoja2!$C$10:$C$13,,1),IF(N14=\"Comercio\",_xlfn.XLOOKUP(X14,Hoja2!$F$10:$F$13,Hoja2!$C$10:$C$13,,1),\"P. Natural\"))),\"\")","v":"P. Natural"}]
[null,null,null,null,null,null,null,null,null,null,null,null,null,null,null,{"$f":"IFERROR(_xlfn.XLOOKUP(O15,'Código CIIU'!$A$2:$A$499,'Código CIIU'!$B$2:$B$499),\"\")","v":""},null,{"$f":"IFERROR(_xlfn.XLOOKUP(MatrizSegmentación!Q15,'Código CIIU'!$A$2:$A$499,'Código CIIU'!$B$2:$B$499),\"\")","v":""},null,null,null,null,"",null,{"$f":"IFERROR(IF(N15=\"Manufacturero\",_xlfn.XLOOKUP(X15,Hoja2!$D$10:$D$13,Hoja2!$C$10:$C$13,,1),IF(N15=\"Servicios\",_xlfn.XLOOKUP(X15,Hoja2!$E$10:$E$13,Hoja2!$C$10:$C$13,,1),IF(N15=\"Comercio\",_xlfn.XLOOKUP(X15,Hoja2!$F$10:$F$13,Hoja2!$C$10:$C$13,,1),\"P. Natural\"))),\"\")","v":"P. Natural"}]
{"$rows_left_out":86}
{"sheet":"PorJurisdicción","index":4,"n_rows":25,"n_cols":9,"rows_kept":25,"cut":false,"hidden":false,"merged":[]}
["NOTA: Cuando Actualice datos, haga clic en alguna de las tablas dinamicas, luego en la parte superior haga clic en analizar tabla dinamica, despues en actualizar y finalmente en actualizar todo"]
[]
["Tipo de contraparte","(Todas)"]
[]
["Municipio","Cuenta de Municipio","Promedio de Nivel de Riesgo Jurisdicción",null,null,"Empresa","Promedio de Nivel de Riesgo Jurisdicción"]
["Quindío",0.5,3.5,null,null,"Aliado de negocio",5]
["Cauca",0.5,5,null,null,"Juridica",5]
["Otro",0,5,null,null,"Cliente",3.5]
["Total general",1,4.625,null,null,"Natural",3.5]
[null,null,null,null,null,"Empleado",0]
[null,null,null,null,null,"Natural",0]
[null,null,null,null,null,"Proveedor",5]
[null,null,null,null,null,"Juridica",5]
[null,null,null,null,null,"(en blanco)"]
[null,null,null,null,null,"(en blanco)"]
{"$rows_left_out":11}
{"sheet":"PorActividadEconómica","index":5,"n_rows":41,"n_cols":9,"rows_kept":41,"cut":false,"hidden":false,"merged":[]}
["NOTA: Cuando Actualice datos, haga clic en alguna de las tablas dinamicas, luego en la parte superior haga clic en analizar tabla dinamica, despues en actualizar y finalmente en actualizar todo"]
[]
["Tipo de contraparte","(Todas)",null,"Tipo de contraparte","(Todas)",null,"Tipo de contraparte","(Todas)"]
[null,null,null,null,null,null,"PEP","Si"]
["Sector","Promedio de Nivel de Riesgo Actividad Económica",null,"Empresa","Promedio de Nivel de Riesgo Actividad Económica"]
["Manufacturero",1,null,"PEDRO PEREZ",1.25,null,"Nombre ","Promedio de Nivel de Riesgo Actividad Económica","Promedio de Nivel de Riesgo Jurisdicción"]
["NA",0.83333333333333337,null,"FABRICA XYZ",1.75,null,"PEDRO PEREZ",1.25,3.5]
["Total general",0.9,null,"XLM CONSULTORES",0.25,null,"LINA GOMEZ",1.25,5]
[null,null,null,"Total general",1.0833333333333333,null,"Total general",1.25,4.25]
[]
[]
[]
["Tipo de contraparte","(Todas)"]
[]
["Actividad Economica Principal","Promedio de Nivel de Riesgo Actividad Económica"]
{"$rows_left_out":27}
{"sheet":"MatrizMonitoreo","index":6,"n_rows":107,"n_cols":166,"rows_kept":107,"cut":false,"hidden":false,"merged":[[6,5,8,5],[6,6,8,6],[6,0,8,0],[6,1,8,1],[6,2,8,2],[6,3,8,3],[6,4,8,4]]}
["Mes inicial","Enero",{"$f":"+_xlfn.XLOOKUP(B1,Hoja2!H1:H12,Hoja2!I1:I12)","v":1},null,null,null,null,{"$f":"+C1","v":1},{"$f":"+IF(H1<12,H1+1,IF(H1=12,1))","v":2},{"$f":"+IF(I1<12,I1+1,IF(I1=12,1))","v":3},{"$f":"+IF(J1<12,J1+1,IF(J1=12,1))","v":4},{"$f":"+IF(K1<12,K1+1,IF(K1=12,1))","v":5},{"$f":"+IF(L1<12,L1+1,IF(L1=12,1))","v":6},{"$f":"+IF(M1<12,M1+1,IF(M1=12,1))","v":7},8,9,10,11,12,1,2,3,4,5,6,7,8,9,10,11,12,1,2,3,4,5,6,7,8,9,10,11,12,1,2,3,4,5,6,7,8,9,10,11,12,1,2,3,4,5,6,7,8,9,10,11,12,1,2,3,4,5,6,7,8,9,10,{"$f":"+IF(BY1<12,BY1+1,IF(BY1=12,1))","v":11},12,1,2,3,4,5,6,7,8,9,10,11,12,1,2,3,4,5,6,7,8,9,10,11,12,1,2,3,4,5,6,7,8,9,10,11,12,1,2,3,4,5,6,7,8,9,10,11,12,1,2,3,4,5,6,7,8,9,10,11,12,1,2,{"$f":"+IF(EK1<12,EK1+1,IF(EK1=12,1))","v":3},4,5,6,7,8,9,10,11,12,1,2,3,4,5,6,7,8,9,10,11,12,1,2,3]
["Año",2023]
["Porcentaje señales de alerta sobre ingresos",1]
["Percentil Señales de Alerta sobre movimientos",0.85]
[]
[]
["No de Identificación","Nombre","Tipo de Contraparte","Ingresos del Ultimo año (Miles)","Movimientos del Mes (Miles)","Señal de Alerta sobre ingresos","Señal de alerta sobre movimientos financieros",null,null,null,null,null,null,null,null,null,null,"HISTORICO DE MOVIMIENTOS FINANCIEROS (Miles de Pesos)"]
[null,null,null,null,null,null,null,{"$f":"+_xlfn.XLOOKUP(H1,Hoja2!$I$1:$I$12,Hoja2!$H$1:$H$12)","v":"Enero"},{"$f":"+_xlfn.XLOOKUP(I1,Hoja2!$I$1:$I$12,Hoja2!$H$1:$H$12)","v":"Febrero"},{"$f":"+_xlfn.XLOOKUP(J1,Hoja2!$I$1:$I$12,Hoja2!$H$1:$H$12)","v":"Marzo"},{"$f":"+_xlfn.XLOOKUP(K1,Hoja2!$I$1:$I$12,Hoja2!$H$1:$H$12)","v":"Abril"},{"$f":"+_xlfn.XLOOKUP(L1,Hoja2!$I$1:$I$12,Hoja2!$H$1:$H$12)","v":"Mayo"},{"$f":"+_xlfn.XLOOKUP(M1,Hoja2!$I$1:$I$12,Hoja2!$H$1:$H$12)","v":"Junio"},{"$f":"+_xlfn.XLOOKUP(N1,Hoja2!$I$1:$I$12,Hoja2!$H$1:$H$12)","v":"Julio"},{"$f":"+_xlfn.XLOOKUP(O1,Hoja2!$I$1:$I$12,Hoja2!$H$1:$H$12)","v":"Agosto"},{"$f":"+_xlfn.XLOOKUP(P1,Hoja2!$I$1:$I$12,Hoja2!$H$1:$H$12)","v":"Septiembre"},{"$f":"+_xlfn.XLOOKUP(Q1,Hoja2!$I$1:$I$12,Hoja2!$H$1:$H$12)","v":"Octubre"},{"$f":"+_xlfn.XLOOKUP(R1,Hoja2!$I$1:$I$12,Hoja2!$H$1:$H$12)","v":"Noviembre"},{"$f":"+_xlfn.XLOOKUP(S1,Hoja2!$I$1:$I$12,Hoja2!$H$1:$H$12)","v":"Diciembre"},{"$f":"+_xlfn.XLOOKUP(T1,Hoja2!$I$1:$I$12,Hoja2!$H$1:$H$12)","v":"Enero"},{"$f":"+_xlfn.XLOOKUP(U1,Hoja2!$I$1:$I$12,Hoja2!$H$1:$H$12)","v":"Febrero"},{"$f":"+_xlfn.XLOOKUP(V1,Hoja2!$I$1:$I$12,Hoja2!$H$1:$H$12)","v":"Marzo"},{"$f":"+_xlfn.XLOOKUP(W1,Hoja2!$I$1:$I$12,Hoja2!$H$1:$H$12)","v":"Abril"},{"$f":"+_xlfn.XLOOKUP(X1,Hoja2!$I$1:$I$12,Hoja2!$H$1:$H$12)","v":"Mayo"},{"$f":"+_xlfn.XLOOKUP(Y1,Hoja2!$I$1:$I$12,Hoja2!$H$1:$H$12)","v":"Junio"},{"$f":"+_xlfn.XLOOKUP(Z1,Hoja2!$I$1:$I$12,Hoja2!$H$1:$H$12)","v":"Julio"},{"$f":"+_xlfn.XLOOKUP(AA1,Hoja2!$I$1:$I$12,Hoja2!$H$1:$H$12)","v":"Agosto"},{"$f":"+_xlfn.XLOOKUP(AB1,Hoja2!$I$1:$I$12,Hoja2!$H$1:$H$12)","v":"Septiembre"},{"$f":"+_xlfn.XLOOKUP(AC1,Hoja2!$I$1:$I$12,Hoja2!$H$1:$H$12)","v":"Octubre"},{"$f":"+_xlfn.XLOOKUP(AD1,Hoja2!$I$1:$I$12,Hoja2!$H$1:$H$12)","v":"Noviembre"},{"$f":"+_xlfn.XLOOKUP(AE1,Hoja2!$I$1:$I$12,Hoja2!$H$1:$H$12)","v":"Diciembre"}]
[null,null,null,null,null,null,null,{"$f":"+B2","v":2023},{"$f":"+IF(I1>H1,H9,H9+1)","v":2023},{"$f":"+IF(J1>I1,I9,I9+1)","v":2023},2023,2023,2023,{"$f":"+IF(N1>M1,M9,M9+1)","v":2023},2023,2023,2023,2023,2023,2024,2024,2024,2024,2024,2024,{"$f":"+IF(Z1>Y1,Y9,Y9+1)","v":2024},2024,2024,2024,{"$f":"+IF(AD1>AC1,AC9,AC9+1)","v":2024},2024]
[79951201,{"$f":"+IFERROR(_xlfn.XLOOKUP(A10,MatrizSegmentación!$E$5:$E$100,MatrizSegmentación!$F$5:$F$100),\"\")","v":"PEDRO PEREZ"},{"$f":"IFERROR(_xlfn.XLOOKUP(A10,MatrizSegmentación!$E$5:$E$100,MatrizSegmentación!$B$5:$B$100),\"\")","v":"Cliente"},{"$f":"IFERROR(_xlfn.XLOOKUP(A10,MatrizSegmentación!$E$5:$E$100,MatrizSegmentación!$X$5:$X$100),0)","v":200000000},8000000,{"$f":"IFERROR(IF(E10>D10/12*(1+$B$3),\"Si\",\"No\"),\"\")","v":"No"},{"$f":"IFERROR(IF(E10>PERCENTILE(H10:AE10,$B$4),\"Si\",\"No\"),\"\")","v":"Si"},10000000,4210381.8045093901,3722299.8583623101,5997020.8016934805,1786077.3541214601]
["900.111.222-2",{"$f":"+IFERROR(_xlfn.XLOOKUP(A11,MatrizSegmentación!$E$5:$E$100,MatrizSegmentación!$F$5:$F$100),\"\")","v":"FABRICA XYZ"},{"$f":"IFERROR(_xlfn.XLOOKUP(A11,MatrizSegmentación!$E$5:$E$100,MatrizSegmentación!$B$5:$B$100),\"\")","v":"Proveedor"},{"$f":"IFERROR(_xlfn.XLOOKUP(A11,MatrizSegmentación!$E$5:$E$100,MatrizSegmentación!$X$5:$X$100),0)","v":100000000},20000000,{"$f":"IFERROR(IF(E11>D11/12*(1+$B$3),\"Si\",\"No\"),\"\")","v":"Si"},{"$f":"IFERROR(IF(E11>PERCENTILE(H11:AE11,$B$4),\"Si\",\"No\"),\"\")","v":"Si"},6632984.3700718302,4416706.2636081902,6905063.19665753,5300736.4590563802,2789585.9564497699]
["860.333.111-3",{"$f":"+IFERROR(_xlfn.XLOOKUP(A12,MatrizSegmentación!$E$5:$E$100,MatrizSegmentación!$F$5:$F$100),\"\")","v":"XLM CONSULTORES"},{"$f":"IFERROR(_xlfn.XLOOKUP(A12,MatrizSegmentación!$E$5:$E$100,MatrizSegmentación!$B$5:$B$100),\"\")","v":"Aliado de negocio"},{"$f":"IFERROR(_xlfn.XLOOKUP(A12,MatrizSegmentación!$E$5:$E$100,MatrizSegmentación!$X$5:$X$100),0)","v":50000000},10000000,"Si","Si",1200000,2300000,3500000,2181490.0429067402,1133978.2384757099]
[1010110112,{"$f":"+IFERROR(_xlfn.XLOOKUP(A13,MatrizSegmentación!$E$5:$E$100,MatrizSegmentación!$F$5:$F$100),\"\")","v":"MIGUEL HERNANDEZ"},{"$f":"IFERROR(_xlfn.XLOOKUP(A13,MatrizSegmentación!$E$5:$E$100,MatrizSegmentación!$B$5:$B$100),\"\")","v":"Empleado"},{"$f":"IFERROR(_xlfn.XLOOKUP(A13,MatrizSegmentación!$E$5:$E$100,MatrizSegmentación!$X$5:$X$100),0)","v":60000000},20000000,"Si","Si",10000000,3000000,5000000,2000000,1000000]
[10101010,{"$f":"+IFERROR(_xlfn.XLOOKUP(A14,MatrizSegmentación!$E$5:$E$100,MatrizSegmentación!$F$5:$F$100),\"\")","v":"LINA GOMEZ"},{"$f":"IFERROR(_xlfn.XLOOKUP(A14,MatrizSegmentación!$E$5:$E$100,MatrizSegmentación!$B$5:$B$100),\"\")","v":"Usuario Final"},{"$f":"IFERROR(_xlfn.XLOOKUP(A14,MatrizSegmentación!$E$5:$E$100,MatrizSegmentación!$X$5:$X$100),0)","v":2000000000},50000000,"No","No",30000000,100000000,35000000,45000000,55000000]
[null,{"$f":"+IFERROR(_xlfn.XLOOKUP(A15,MatrizSegmentación!$E$5:$E$100,MatrizSegmentación!$F$5:$F$100),\"\")","v":0},{"$f":"IFERROR(_xlfn.XLOOKUP(A15,MatrizSegmentación!$E$5:$E$100,MatrizSegmentación!$B$5:$B$100),\"\")","v":0},{"$f":"IFERROR(_xlfn.XLOOKUP(A15,MatrizSegmentación!$E$5:$E$100,MatrizSegmentación!$X$5:$X$100),0)","v":0},null,"No",""]
{"$rows_left_out":93}
{"sheet":"S.AlertaCuantitativas","index":7,"n_rows":11,"n_cols":5,"rows_kept":11,"cut":false,"hidden":false,"merged":[]}
["NOTA: Cuando Actualice datos, haga clic en alguna de las tablas dinamicas, luego en la parte superior haga clic en analizar tabla dinamica, despues en actualizar y finalmente en actualizar todo"]
[]
["Tipo de Contraparte","(Todas)",null,"Tipo de Contraparte","(Todas)"]
["Señal de Alerta sobre ingresos","Si",null,"Señal de alerta sobre movimientos financieros","Si"]
[]
["Nombre de la contraparte","Suma de Movimientos del Mes (Miles)",null,"Nombre de la contraparte","Suma de Movimientos del Mes (Miles)"]
["FABRICA XYZ",20000000,null,"FABRICA XYZ",20000000]
["XLM CONSULTORES",10000000,null,"XLM CONSULTORES",10000000]
["MIGUEL HERNANDEZ",20000000,null,"PEDRO PEREZ",8000000]
["Total general",50000000,null,"MIGUEL HERNANDEZ",20000000]
[null,null,null,"Total general",58000000]